Home

Cucumber no tests found

Cucumber feature files should be executed by maven. Current Behavior. Maven console is showing no tests to run. Steps to Reproduce (for bugs) Download the file from https://drive.google.com/open?id=0B4SgyzyvwKhiTF9SZG96eDBNT1U; Run the project as maven test; Features files are not getting executed by Maven; Your Environment. MacOS Selenium 3.4.0 Cucumber 1.2. Read: -1 01:51:01 V/ddms: execute: returning com.android.builder.testing.ConnectedDevice > No tests found.[Pixel XL - 10] FAILED No tests found. This usually means that your test classes are not in the form that your test runner expects (e.g. don't inherit from TestCase or lack @Test annotations). 01:51:01 I/XmlResultReporter: XML test result file generated at /Users/leo/Projects/Bootstrap/app/build/outputs/androidTest-results/connected/TEST-Pixel XL - 10-app-.xml. Total tests 1. No tests found in your file: /my-project/test/cypress/integration/google.js We could not detect any tests in the above file. Write some tests and re-run. This is my plugins/index.js I have. const cucumber = require('cypress-cucumber-preprocessor').default module.exports = on => { on('file:preprocessor', cucumber()) } My cypress.json fil A project with Cucumber and TestNG does not require a class with a method annotated with @Test. The No test were found might be related to the way you run the Cucumber tests. Find below a minimal project to show base requirements

Submission of Cucumber results says No tests found in execution result Most probably you're trying to submit a Cucumber JSON results file without having previously created the Cucumber Tests (e.g., Scenario/Scenario Outline) in Jira. You need to first have these Test issues created in Jira, with the correct specification. Then, you need to export those Tests to one or more Cucumber .feature files, so you're able to run them in your CI environment {error:No Cucumber Tests were found when exporting} % Any idea how to resolve? You must be a registered user to add a comment. If you've already registered, sign in. Otherwise, register and sign in. Comment; Reply. Suggest an answer. Log in or Sign up to answer . Still have a question? Get fast answers from people who know. Sign up for free Log in . Was this helpful? Yes No. Thanks.

Cucumber tests are not getting executed by maven, No

  1. Cucumber Core 1.2.5 Cucumber html 0.2.3 Cucumber Java 1.2.5 Cucumber JVM deps 1.0.5 Cucumber picocontainer 1.2.5 gherkin 2.12.2. I'm getting the following exception while trying to run, cucumber.runtime.CucumberException: No backends were found. Please make sure you have a have a backend module on your CLASSPATH. at cucumber.runtime.Runtime.<init>(Runtime.java:80) at cucumber.runtime.Runtime.<init>(Runtime.java:69) at cucumber.runtime.Runtime.<init>(Runtime.java:65) at cucumber.
  2. ERROR: Step â Publish Cucumber test result reportâ failed: No test reports that matches *.json found. Configuration error? Finished: FAILURE --You received this message because you are subscribed to the Google Groups Jenkins Users group. To unsubscribe from this group and stop receiving emails from it, send an email to jenkinsci-users+***@googlegroups.com. To view this discussion on the.
  3. As per your code reference testng.xml and your test class there is no method getTestNgTest1 inside the class com.rest.api.authentications.OAuth2APITest Change the testng.xml to the below one probably it will wor
  4. To use Kotlin, we need to add it to our project: Add a directory named kotlin in your src/test directory and mark it as Test Sources Root.In IntelliJ, you can do so by right-clicking on the kotlin directory and selecting Mark Directory as > Test Sources Root.; Create the hellocucumber package inside the kotlin directory.; Create a Kotlin class called RunCucumberTest inside the.

Submission of Cucumber results says No tests found in execution result You're probably trying to submit a Cucumber JSON results file without having previously created the Cucumber Tests (e.g., Scenario/Scenario Outline) in Jira. You need to first have these Test issues created in Jira, with the correct specification. Then, you need to export those Tests to one or more Cucumber .feature files, so you're able to run them in your CI environment * What went wrong: Execution failed for task ':test'. > No tests found for given includes: [com.some.package.TestClass](--tests filter) * Try: Run with --debug option to get more log output. Run with --scan to get full insights. * Exception is: org.gradle.api.tasks.TaskExecutionException: Execution failed for task ':test'. at org.gradle.api.internal.tasks.execution.ExecuteActionsTaskExecuter.lambda$executeIfValid$1(ExecuteActionsTaskExecuter.java:205) at org.gradle.internal.Try. From Cypress and Cucumber point of view, the only problem that we needed to solve is that we needed to call to this commands (or requests) while setting tests data up

General Guidelines

No tests found. when running gradle app:connectedCheck ..

Now that we have defined the test its time to run our test. But before we do that we have to add a class for running our tests. Cucumber uses Junit framework to run. If you are not familiar with JUnit read our tutorials here. As Cucumber uses Junit we need to have a Test Runner class.This class will use the Junit annotation @RunWith(), which tells JUnit what is the test runner class ich benutze eclipse als IDE und Selenium web driver. ich bin zu versuchen zu laufen test in der cucumber-JVM. wenn ich ausführen, testen Sie es mir zeige Cucumber is basically a test runner. It loads the feature files prior to running the test code. In that process, Cucumber uses regex to map a certain feature step to the written test code. Only this way you can get proper test results in the end. In the report file, each feature step will then have either a failed, passed, pending or undefined flag set Cucumber Selenium WebDriver Java Integration with Example: In the last tutorial, we discussed the Cucumber tool, its usage and different features.. Moving ahead in our free Selenium online training series, we will discuss how to set up a cucumber project and will discuss the integration of Selenium WebDriver with Cucumber.. We will set up a Cucumber project with Maven QA Automation Pipeline with CI/CD - Cucumber + Xray (Jira) + Selenium (Ruby) + Jenkins . With the popularity of Continuous Integration and Continuous Delivery practices, automated testing is gaining an increased slice of the overall testing specification. This is no surprise since automated tests provide great benefits over manual testing. It.

No tests found in your file · Issue #130 · TheBrainFamily

  1. Adds tab in Bamboo build summary page to show cucumber reports. Can fail build if any scenario with specific tag is failed. Can fail build if percentage of tests are failed as configured. Can fail build if NO tests are found. Control status of deployments based on Cucumber tests results
  2. The unusual Popup Message No tests found with test runner 'JUnit5' is often seen when running test classes in spring boot application. In eclipse, when you run the JUnit test case in your spring boot application, some time you'll encounter a problem that eclipse can't find any tests. In this case, eclipse will send a popup message saying No tests found with test runner.
  3. @ContextHierarcy is found, it will try to load cucumber.xml from the classpath. The step definitions added to the TestContextManagers context and is reloaded for each scenario. The rational for defining all the step definition classes in the same Spring context is to enable them do interact, share state using Spring mechanisms (@autowire etc). If you need to have different sets of annotations.
  4. Hi, At first there is no need to specify Teamcity::Cucumber::Formatter formatter explicitly. If no '--format' option is given RubyMine will use our formatter implicitly. More over if --format or --drb options are explicitly specified RubyMine wont attach GUI to tests results

TestNG: No tests were found when running tests via testn

When I attempt to run an entire folder of unit tests, I am told that No tests were found. I am told that Tests were not found in module [OMITTED MODULE NAME]. Use module [OTHER OMITTED MODULE NAME] instead. I have changed and applied the classpath to the specified module under Run -> Debug Configurations, but I every time I run the folder again it reverts to the prior classpath. When I. It generates Cucumber report in target/json/cucumber.json. We can see the test with the new tag XRAY-1 in a published report. But when we try to enable Xray: Results Import Task we get. ERROR: Step 'Xray: Results Import Task' failed: Unable to confirm Result of the upload..... Upload Failed! Status:400 Response:No tests found in execution resul They are used to identify all the steps executed in the test and troubleshoot errors for the failed step. Text Logs are accessible from the Automate dashboard or via our REST API. Visual logs. Visual Logs automatically capture the screenshots generated at every Selenium command run through your Cucumber JS tests. Visual logs help with debugging. Cucumber for Scala; Cucumber for Ruby. To use Cucumber with Ruby, the following plugins and gems must be installed and enabled: The Ruby plugin. The Gherkin plugin. cucumber gem (for Ruby projects), or cucumber and cucumber-rails (for Rails applications); see Bundler. For more information, refer to Cucumber for Ruby. Cucumber for JavaScrip

thanks, I was running Cucumber with rake and couldn't see how to attach the debugger. Now I tried to run a Cucumber configuration with debugger, which I created as shown on your screenshot, but I get a no tests found message. Test are running fine either with rake or without debugger. Do you have an idea, why running with debugger doesn't. Run Cucumber tests. The quickest way of running Cucumber tests is by using the icons in the gutter next to the necessary feature or scenario. The icons change depending on the state of your test: marks new tests; marks successful tests; icon marks failed tests. Run a scenari 0 Scenarios , 0 Steps, Empty test suite in Cucumber - YouTube. 0 Scenarios , 0 Steps, Empty test suite in Cucumber. Watch later. Share Getting No Definition found for each steps in Feature file however i have mentioned glue of these steps in Step Definition file. Working on eclipse. Please help me out with this issue. -Sonal - user43357 Jan 30 '20 at 6:1 Let's look a situation when couple of tests failed there. Cucumber runner generates a new report, for example, cucumber-rerun.json as a result of rerun the failed tests. In that case you will have a merged report where all failed tests from the original cucumber.json file are overridden with the results from the cucumber-rerun.json. Type: boolean; pendingStepsNumber (optional) Maximum number.

cucumber.yml was found, but cannot be parsed. Please refer to cucumber's documentation on correct profile usage. Before all these, I had run a simulation of the gem updates on my local machine including running all tests to make sure there were no surprises when updating the test server. But I was still caught off-guard. I didn't see that. Running your Selenium tests with Cucumber NodeJS on BrowserStack is simple. This guide will help you: Run your first test; Integrating your tests with BrowserStack; Mark tests as passed or failed; Debug your app; Prerequisites. Before you can start running your Selenium tests with Cucumber JS, Install Cucumber JS using np Test method @Test public void runcukestest() never run cause Cucumber Test Runner ignore test Class methods NO PROBLEM HERE!. Only want to remark-----1 Scenarios (1 failed) 3 Steps (1 failed, 2 undefined) 0m0.270s-----Case 2: @RunWith(RobolectricTestRunner.class) Maven Output: RoboCuke / fails_outputs / with_RobolectricTestRunner_output.tx I have found no other documentation or instructions on how to config CircleCI/Cucumber to output useful info in the Test Summary. I'm pretty sure it used to give me details about why the feature failed, but maybe not. Any insight on what I need to do to get some 'output' from Cucumber feature failures? Thank cucumber.execution.order= # lexical, reverse, random or random:[seed] (CLI only). default: lexical cucumber.execution.strict= # true or false. default: true. cucumber.execution.wip= # true or false. default: false. cucumber.features= # command separated paths to feature files. example: path/to/example.feature, path/to/other.feature cucumber.filter.name= # regex. example: .*Hello.* cucumber.filter.tags= # tag expression. example: @smoke and not @slow cucumber.glue= # comma separated package.

Cucumber Open. Test business-readable specs against your code on any modern dev stack. Contribute Sponsors. CucumberStudio. Empower your team to collaborate and harness the power of examples . Cucumber for Jira. Strengthen BDD collaboration and create living documentation in Jira. Docs. Cucumber Open Docs. GETTING STARTED. Installation Guides. 10 Minute Tutorial Gherkin Syntax. PRO. Cucumber School Online Develop the skills and confidence you need to make the most of BDD and Cucumber, with FREE world-class training and online tutorials. Learn More Cucumber School Live This hands-on day gives developers and test engineers the practical grounding to use Cucumber to validate and automate requirements Cucumber uses regular expression match to isolate test data and pass it into the right step. Also, it allows us to be more flexible when writing scenarios. Regex looks scary, complex and hard to maintain. But the reality is that we need a small subset of regex to make our cucumber framework more readable and flexible. In this article I will provide you the most common regex expressions which you can grab and use for your BDD scenarios implementation More details can be found in Running Cucumber tests in parallel post. Runners feature file. If the runner is not linked to any feature file (no features section defined in @CucumberOptions, like the one shown above) then runner automatically searches for all feature files in current and all child folders I have yet to find a single article that even hints at using Cucumber to test any aspect of an existing RoR application. I'm interested to know if you are aware of anyone who has taken a completed RoR application and then started to test it, in an ongoing manner, using Cucumber. From what I understand, it would be a very challenging process to create scenarios to match the existing application functions. (Then there would be the added challenge of going to the end user and.

Effects of exogenous spermidine on photosynthetic capacityCucumber for Bamboo | Atlassian Marketplace

Testing with Cucumber - Xray for JIRA 3

thanks, I was running Cucumber with rake and couldn't see how to attach the debugger. Now I tried to run a Cucumber configuration with debugger, which I created as shown on your screenshot, but I get a no tests found message. Test are running fine either with rake or without debugger. Do you have an idea, why running with debugger doesn't work here Cucumber. Last modified: 14 April 2021. Cucumber is a testing framework that supports behavior-driven development and allows you to write features and scenarios in a human-readable language. Cucumber support in IntelliJ IDEA includes the following features: Syntax and error highlighting. Code completion

If you are getting irritated by the continuous opening of the browser for each scenario, just pass the parameter -b with a phantomjs value, so it will run the test against the headless browser. CucumberException: No features found at [] at cucumber. runtime. model. CucumberFeature. load (CucumberFeature. java: 47 cucumber是一款测试工具。. 可用于大多数主流编程语言。. 比如JAVA、JS、Ruby、C++、Lua、Android、Kotlin、C#/F#、PHP、Python、Go、Groovy、Scala等等。. 其中JAVA、JS、Ruby的代码托管在 cucumber 下。. 官方建议选择与生产代码相同的平台或编程语言的实现。. 本文主要是JAVA平台下的介绍教程。. 使用方法非常简单,创建一个mvn工程,在pom.xml文件引入以下依赖即可。 In AS, just right click on some of the code directories (for example androidTest) and select New -> Edit File Templates. Right click on AS directory (package) In the following Dialog, under File. In this article, we saw how we can easily set up Cucumber for our End to End tests thanks to the Angular CLI which does half the job by creating for us the initial Protractor setup. The full source code for this article can be found in this Github repository. If you enjoyed this article, follow @ahasall on Twitter for more content like this. Amadou Sall. Hi I'm Amadou Sall, a Frontend Software.

Solved: Using Xray API to import cucumber test results - 4

Cucumber Test Results plugin; Cucumber Reports; Cucumber perf plugin ; Make sure while installing all the dependent plugins are successfully installed or else the reporting plugins might not work. Now navigate to Manage -> Global Tool Configuration. Set the path for JDK. Set the path for Maven. Create a new item as a Maven Project. Once the job got created, click on the configure link present. A detailed tutorial on using Cucumber-JVM with Serenity can be found here, and more information on Serenity can be found on their official website. Serenity BDD is an open source reporting library that helps you write better structured, more maintainable automated acceptance criteria. Serenity also produces rich meaningful test reports (or living documentation) that report not only the. Cucumber is a popular BDD test automation tool. Cucumber-JVM is the Java implementation of Cucumber, and is what we will be focusing on in this article. In Cucumber, you express acceptance criteria in a natural, human-readable form. For example, we could write the wool scarf example mentioned above like this

I bought into the idea—describing test cases in plain English—but in practice I found Cucumber not to be very valuable. In fact, my experience has been that Cucumber adds a negative amount of value. In recent years I've noticed (although this is anecdotal and might just be my perception) that fewer codebases seem to use Cucumber and that fewer Rails developers seem to be on board with. This is probably old news, but I only recently found out that there is a way for Cucumber tests running in Ruby to automatically retry when they fail. Here's a sample failing test: Apparently we can just add a --retry command to set the test to retry if it fails. And we can set how many times we want the test to retry Cucumber also supports rich output formats like images and videos. Browser automation. Cucumber does not provide built in browser automation. However, it does work well with existing programs such as Selenium and WATiR-WebDriver. It does support running tests with transactions through leveraging other programs such as ActiveRecord

Cucumber-JVM 2.0 was released in August 2017 and should be used for new Cucumber-JVM projects. Releases may be found under Maven Group ID io.cucumber. Older Cucumber-JVM 1.x versions may be found under Maven Group ID info.cukes. Build Management. Apache Maven is the preferred build management tool for Cucumber-JVM projects. All Cucumber-JVM packages are available from the Maven Central. Created April 11, 2011 17:24. Hey there, Running v3.1.1 (103.260) and after a little bit of pain i am able to get Cucumber 0.10.2 to work via the Rake Task. IE Tools >> Rake Tasks >> Cucumber. By work, it will fire up the Run panel, show the test spinner on the left, use Capybara / Web Drive and run through all the tests When you want to import the cucumber test results to a specific test execution you should add the test execution key to the tags field of the cucumber feature. You can see where to add it exactly if you create a test execution manually, add the cucumber tests there and then export the test execution to cucumber. You will see that for every .feature file, there will be a tag with the test. No tests in my project are found, below is an example class I created in the project under src -> main -> test -> groovy directory. import spock.lang.Specification class SomeTestClass extends Specification { def A test that should work () { given: def someNumber = 1 when: def anotherNumber = someNumber + 1 then: anotherNumber == 2 }. When we talk about Cucumber JVM for Behavior Driven development, we often talk about @CucumberOptions. JUnit Runner Create one empty class with the @RunWith(Cucumber.class) annotation. Executing this class as any JUnit test class will run all features found on the classpath in the same package as this class.Name of the class could be anything lik

In addition, one test-tube study found that cucumbers may be effective at reducing oxidative stress and preventing diabetes-related complications . However, the current evidence is limited to test. Hydroalcoholıc cucumber (Cucumis sativus) fruit extract was entrapped in the inner aqueous phase of w/o emulsion. Base containing no extract and a formulation containing 3% concentrated extract. Hello, I am trying to run a test configuration that will runs all rspec tests in the rspec folder, but, I get the error No tests were found. If I run a test for single file inside the folder of rspec, the test will pass. In the Configuration, please see the attached pic. In my gemFile: group :test, :development do. gem 'turn', :require => false Let's start with the test setup. Test setup file. We'll make use of two Cucumber.js features to set up our tests: Before, After, BeforeAll and AfterAll hooks and the 'World' instance. Scenario hooks allow you to run code before and after test runs and are a great place to intialise things. The World instance is, to quote the Cucumber.js docs

Cucumber Tests to be run in JMeter

Thanks to Cucumber, all testers, no matter what their skill levels are, can participate in the process of performing automation tests. Let's take a look at the above example: Any tester who is aware of the business logic and workflow can write feature files, add more scenarios, and test datasets I tend not to shy away from the frontend, but I prefer the backend because it is usually much easier to test. This backend focus has allowed me to almost entirely miss out on JavaScript development. I can't say that I mind that much. I use JavaScript when a web page needs it, but I use Google a lot to find examples I can modify to fit my needs. One thing I am curious about though is to be able. Importing Cucumber Tests. The following endpoint is provided to import a Cucumber .feature file or a zip file containing multiple .feature files. The files in the zip file may be in folders/subfolders. In addition to the .feature or a zip file the endpoint also accepts a JSON file which can specify additional information that will be added to the Test or Precondition at the moment of their. An introduction to using test automation tool, Cucumber, as a part of your Behavior-Driven Development strategy. by Federico Toledo · by Luis Zambra · Jun. 11, 19 · DevOps Zone · Tutorial.

My .feature file is not being found. When I run the junit test I get the following output. No features found at [classpath:se] 0 Scenarios 0 Step Setting Cypress and Cucumber in e2e tests. Lucas Fraga . Apr 3, 2019 · 4 min read. cypress and cucumber — frameworks. Do you know Cypress? Have ever you used or even read its incredible.

ERROR: Step 'Publish Cucumber test result report' failed

A test harness for Cucumber and rspec allows for separating responsibility between setting up the context and interacting with the browser and cleaning up the step definition files. 25. When to use Rspec and when to use Cucumber? ↑ Rspec is used for Unit Testing. Cucumber is used for Behavior-driven development. Cucumber can be used for System and Integration Tests. 26. What software do you. observe that IntelliJ will give you no test were found observe also if you change the code (whether the API and test method), it will recompile and test will work again. forget to mention IntelliJ setup, hope this info below be enough . IntelliJ IDEA 2019.3.3 (Ultimate Edition) Build #IU-193.6494.35, built on February 11, 2020 Runtime version: 11..5+10-b520.38 amd64 VM: OpenJDK 64-Bit Server. Run cucumber-js to see that no scenarios/steps are found. $ npx cucumber-js 0 scenarios 0 steps 0m00.000s Feature. Create a directory named features: $ mkdir features. The spelling and capitalization of the directory name must be exact here. Create a .feature file inside the directory. We'll name it google-search.feature: $ touch features. Here Cucumber Test Runner is called on @Test public void runcukestest() . I do this for ensure that all Cucumber-JVM classes get loaded within Robolectric AsmInstrumentingClassLoader and correct SDK environment is set. But Cucumber fail with Scenarios and/or Steps, don´t know. -----0 Scenarios 0 Steps 0m0.000s-----Case 3: @RunWith(RoboCucumber.class) Maven Output: RoboCuke / fails. Cucumber is a tool for running automated tests written in plain language. In this article, we are going to create a Javascript CucumberJS test using ES6. The goal is to start a browser and run an automated test on www.google.com

api testing - TestNG- No tests found

Hello everybody. I would like to show you a gem today that I found out. Apparently there is no easy way to get to the name of an executing cucumber scenario in cucumber-jvm You can try something like that: @After //this is cucumbers @Afters public static void afterExecution(Scenario scenario) { logger.log(The status of the test is: + scenario.getStatus()); } But that isn't giving you too. This test is based on increased peroxidase activity after bruising (Miller & Kelley, 1989). Wen et al. (2012) used PCR to identify frozen or dried sea cucumbers, and found that certain products marketed as A. japonicus were in fact Isostichopus sp. In this context, PCR-RFLP and FINS methods are also useful to detect the fraudulent labeling of sea cucumber products (Wen et al., 2010.

Background in Cucumber is used to define a step or series of steps that are common to all the tests in the feature file. It allows you to add some context to the scenarios for a feature where it is defined. A Background is much like a scenario containing a number of steps Create Cucumber tests (e.g. Scenario/Scenario Outlines) and their respective step code in some other tool. add a unique tag to each Scenario/Scenario outline, in the form of @id:xxx, in which xxx is a number (e.g. 1, 2, 3, ). so this is the way Xray identified unique scenarios and create tests accordingly in JIRA. Implement Code (Step definition) for feature file and modify steps if. Running all tags when no matching scenario is found hot 14 cypress-cucumber-example not working with bundled features hot 11 Preprocessing breaks if integration folder is not below package root hot Cucumber Automation Tool Tool that executes plain text functional descriptions as automated test Runs automated acceptance test on Web applications Language that Cucumber understands is called Gherkin Cucumber Test are written in a file called Feature Feature file contains list of test scenarios Each line in a scenario is called step which are defined with the help of Given.

10 Minute Tutorial - Cucumber Documentatio

Testing in BDD with Gherkin based frameworks (e

Create gradle or maven based project in your favorite IDE or tool. The name of the project is cucumber-tags. I am using here Junit 5 so I need to use Junit Vintage engine as Cucumber is compatible with Junit 4 only as of now. Remember feature file, Java classes are written into src/test/resources or src/test/java folder In this tutorial, we will create Cucumber Scripts to test two scenarios . Cucumber Script 1: Multiply 2 Numbers; Cucumber Script 2: Verify output when Email id is entered or not entered; Cucumber Script 1: Multiply 2 Numbers. Step 1) Open RubyMine Editor via windows start menu . Step 2) In Rubymine Editor, click on Create New Project . Step 3) Select the Project location and click Create. How are you running your eclipse project. I would stick a breakpoint and see what file it's trying to find. It could be the testng file given it's a testng error or.

THIS MODULE ONLY CREATES A JSON, NO REPORT!! What does it do# This reporter will generate a Cucumber JSON file for each feature that is being tested. The JSON file can be used with whatever report you want to use like for example multiple-cucumber-html-reporter. It will also add metadata about the running instance to the feature file and last but not least, it will give you the opportunity to. There are no tests to run. Results : Tests run: 0, Failures: 0, Errors: 0, Skipped: 0. micha kops Says: July 6th, 2015 at 4:26 am. Hi Srikant, did you add cucumber-junit as a dependency to your project and have you added @RunWith(Cucumber.class) to your test class? dahuchao Says: July 17th, 2015 at 2:45 pm. Thanks a lot for that post. It was. These automatically inferred test reports require no specific configuration of your pipelines, and are a zero-effort way to get started using Test Reporting. See the list of runners for which test results are automatically inferred. As only limited test metadata is present in such inferred reports, they are limited in features and capabilities. The following features are not available for.

There are no logic details written in the feature file. Steps Definitions. We have got our feature file ready with the test scenarios defined. However, this is not the complete job done. Cucumber doesn't really know which piece of code is to be executed for any specific scenario outlined in a feature file Adult echinoderms are found on the sea bed at every ocean depth, a large stomach and a rectum with the anus at the apex of the test. Sea cucumbers are mostly detritivores, sorting through the sediment with their buccal tentacles which are modified tube feet. Sand and mud accompanies their food through their simple gut which has a long coiled intestine and a capacious cloaca. Crinoids are. The Cucumber advertise is relied upon to develop to more than $5 billion by 2021, from just $180 million, as per Selenium industry gauges. In this way, despite everything you have the chance to push forward in your vocation in Selenium Development. GangBoard offers Advanced Cucumber Interview Questions and answers that assist you in splitting your PowerPoint interview and procure dream. Install Cucumber Eclipse Plugin. We can use cucumber in eclipse only after plugin. In order to plugin cucumber with eclipse, use the following steps: Step 1. In a first step, make sure the availability of good Internet connection. Now, launch the Eclipse IDE then go to Help menu, and click Install New Software. Step

Boozang | Run from CLI - Boozang

Gradle 6.3 rc 4 No tests found for given includes · Issue ..

How to integrate Cypress and Cucumber in your development

{Minneapolis Costumers Sew {To Save|To Avoid Wasting|To

The glue between Gherkin and the system under test are implemented as regular Java methods and implemented in regular Java classes. The steps are global in the sense that every step in the same package or subpackage relative to the runner will be found and executed. This allows us to define one step in one class and another step in another class. Dividing steps between many classes may be a. Test automation with Cucumber-JVM 1. Boston Java Meetup, 13/06/2013 Test Automation with Cucumber-JVM Alan Parkinson @alan_parkinson 2. Cucumber is a tool that executes plain-text functional descriptions as automated tests • Tests written in business-facing text Supports over 40 spoken languages This test is called Gherkin • Automation written in target language Ruby, Java, Scala, Groovy. Now run the Test Runner class as TestNG test and should be able to run your tests using Cucumber with TestNG & Selenium. Download code. About the course. NPN Training is counted among the top ten Selenium Training in Bangalore for providing the best Selenium training in Bangalore. Our selenium course content and syllabus is designed according to the industry requirement to accomplish everyone. cucumber Bedeutung, Definition cucumber: 1. a long, thin, pale green vegetable with dark green skin, usually eaten uncooked in salads 2. a

  • Leckere Kuchenrezepte mit Pudding.
  • WIKA 9052810.
  • Windows 10 2004 Bing Suche deaktivieren.
  • Haarausfall mit Wurzel nach färben.
  • GTX 1050 TI mediamarkt.
  • VW Diesel Update Katalysator Lampe leuchtet.
  • Trunks hose.
  • FrieslandCampina Standorte.
  • Liegenschaftsnummer was ist das.
  • Kindersitz isofix 0 36.
  • Visum Kanada Bearbeitungszeit.
  • Isaac the marathon.
  • Rauchen in den 70ern.
  • Mezza Lo Shrine.
  • Zeitdehnung.
  • Software Nährwertberechnung.
  • WoW Geheimnisse.
  • Zuckerschock Tod.
  • Preußische Reformen referat.
  • Alexis ROM S8.
  • Hilaria Baldwin News.
  • Begrüßung Firmung.
  • Office 2010 Activator.
  • Botticelli Werke.
  • Lufthansa Cargo Impfstoff.
  • Verzehr von Speisen in der Öffentlichkeit Corona.
  • Mehrdrähtige Leiter Aderendhülse.
  • DanWest 3460.
  • Muss man sich schminken.
  • Dsl Rufnummer Telekom.
  • Postleitzahl 7.
  • Tiger 800 XRT.
  • Kleiderspende Obdachlose Berlin.
  • Dichotome Variable.
  • Inglot Swinemünde.
  • Holzpellets Pferd.
  • Elite Dangerous horizons or normal.
  • Tiger 800 XRT.
  • Ernährung und Körper.
  • Streetfighter Treffen 2020.
  • Vegane Streusel mit Öl.